CRAN Package Check Results for Package fingertipsR

Last updated on 2020-01-18 07:59:46 CET.

Flavor Version Tinstall Tcheck Ttotal Status Flags
r-devel-linux-x86_64-debian-clang 1.0.0 6.45 120.65 127.10 ERROR
r-devel-linux-x86_64-debian-gcc 1.0.0 5.48 92.08 97.56 ERROR
r-devel-linux-x86_64-fedora-clang 1.0.0 158.37 ERROR
r-devel-linux-x86_64-fedora-gcc 1.0.0 149.58 ERROR
r-devel-windows-ix86+x86_64 1.0.0 30.00 565.00 595.00 ERROR
r-devel-windows-ix86+x86_64-gcc8 1.0.0 20.00 1455.00 1475.00 OK
r-patched-linux-x86_64 1.0.0 5.93 106.95 112.88 ERROR
r-patched-solaris-x86 1.0.0 197.60 ERROR
r-release-linux-x86_64 1.0.0 5.23 108.39 113.62 ERROR
r-release-windows-ix86+x86_64 1.0.0 22.00 1026.00 1048.00 OK
r-release-osx-x86_64 1.0.0 WARN
r-oldrel-windows-ix86+x86_64 1.0.0 13.00 413.00 426.00 ERROR
r-oldrel-osx-x86_64 1.0.0 WARN

Check Details

Version: 1.0.0
Check: tests
Result: ERROR
     Running 'a-c.R' [6s/25s]
     Running 'd.R' [12s/70s]
     Running 'e.R' [29s/163s]
     Running 'f-z.R' [13s/56s]
    Running the tests in 'tests/d.R' failed.
    Complete output:
     > library(testthat)
     > library(fingertipsR)
     >
     > test_check("fingertipsR", filter = "^[d]")
    
     |
     | | 0%
     |
     |================== | 25%
     |
     |=================================== | 50%
     |
     |==================================================== | 75%
     |
     |======================================================================| 100%-- 1. Failure: the columns of deprivation decile function are as expected (@test
     nrow(dep_102_2015) > 2 isn't true.
    
     -- 2. Failure: the columns of deprivation decile function are as expected (@test
     nrow(dep_101_2015) > 2 isn't true.
    
     -- 3. Failure: the columns of deprivation decile function are as expected (@test
     nrow(dep_7_2015) > 2 isn't true.
    
     -- 4. Failure: the columns of deprivation decile function are as expected (@test
     nrow(dep_201_2015) > 2 isn't true.
    
     -- 5. Failure: the columns of deprivation decile function are as expected (@test
     nrow(dep_202_2015) > 2 isn't true.
    
     -- 6. Failure: the columns of deprivation decile function are as expected (@test
     nrow(dep_154_2015) > 2 isn't true.
    
     -- 7. Failure: the columns of deprivation decile function are as expected (@test
     nrow(dep_165_2015) > 2 isn't true.
    
     -- 8. Failure: the columns of deprivation decile function are as expected (@test
     nrow(dep_8_2015) > 2 isn't true.
    
     == testthat results ===========================================================
     [ OK: 42 | SKIPPED: 0 | WARNINGS: 0 | FAILED: 8 ]
     1. Failure: the columns of deprivation decile function are as expected (@test-deprivation.R#105)
     2. Failure: the columns of deprivation decile function are as expected (@test-deprivation.R#107)
     3. Failure: the columns of deprivation decile function are as expected (@test-deprivation.R#111)
     4. Failure: the columns of deprivation decile function are as expected (@test-deprivation.R#113)
     5. Failure: the columns of deprivation decile function are as expected (@test-deprivation.R#115)
     6. Failure: the columns of deprivation decile function are as expected (@test-deprivation.R#117)
     7. Failure: the columns of deprivation decile function are as expected (@test-deprivation.R#119)
     8. Failure: the columns of deprivation decile function are as expected (@test-deprivation.R#121)
    
     Error: testthat unit tests failed
     Execution halted
Flavor: r-devel-linux-x86_64-debian-clang

Version: 1.0.0
Check: re-building of vignette outputs
Result: WARN
    Error(s) in re-building vignettes:
     ...
    --- re-building 'lifeExpectancy.Rmd' using rmarkdown
    Quitting from lines 140-156 (lifeExpectancy.Rmd)
    Error: processing vignette 'lifeExpectancy.Rmd' failed with diagnostics:
    Faceting variables must have at least one value
    --- failed re-building 'lifeExpectancy.Rmd'
    
    --- re-building 'selectIndicatorsRedRed.Rmd' using rmarkdown
    --- finished re-building 'selectIndicatorsRedRed.Rmd'
    
    SUMMARY: processing the following file failed:
     'lifeExpectancy.Rmd'
    
    Error: Vignette re-building failed.
    Execution halted
Flavors: r-devel-linux-x86_64-debian-clang, r-devel-linux-x86_64-debian-gcc, r-patched-linux-x86_64, r-release-linux-x86_64

Version: 1.0.0
Check: tests
Result: ERROR
     Running ‘a-c.R’ [4s/23s]
     Running ‘d.R’ [9s/63s]
     Running ‘e.R’ [22s/160s]
     Running ‘f-z.R’ [11s/54s]
    Running the tests in ‘tests/d.R’ failed.
    Complete output:
     > library(testthat)
     > library(fingertipsR)
     >
     > test_check("fingertipsR", filter = "^[d]")
    
     |
     | | 0%
     |
     |================== | 25%
     |
     |=================================== | 50%
     |
     |==================================================== | 75%
     |
     |======================================================================| 100%── 1. Failure: the columns of deprivation decile function are as expected (@test
     nrow(dep_102_2015) > 2 isn't true.
    
     ── 2. Failure: the columns of deprivation decile function are as expected (@test
     nrow(dep_101_2015) > 2 isn't true.
    
     ── 3. Failure: the columns of deprivation decile function are as expected (@test
     nrow(dep_7_2015) > 2 isn't true.
    
     ── 4. Failure: the columns of deprivation decile function are as expected (@test
     nrow(dep_201_2015) > 2 isn't true.
    
     ── 5. Failure: the columns of deprivation decile function are as expected (@test
     nrow(dep_202_2015) > 2 isn't true.
    
     ── 6. Failure: the columns of deprivation decile function are as expected (@test
     nrow(dep_154_2015) > 2 isn't true.
    
     ── 7. Failure: the columns of deprivation decile function are as expected (@test
     nrow(dep_165_2015) > 2 isn't true.
    
     ── 8. Failure: the columns of deprivation decile function are as expected (@test
     nrow(dep_8_2015) > 2 isn't true.
    
     ══ testthat results ═══════════════════════════════════════════════════════════
     [ OK: 42 | SKIPPED: 0 | WARNINGS: 0 | FAILED: 8 ]
     1. Failure: the columns of deprivation decile function are as expected (@test-deprivation.R#105)
     2. Failure: the columns of deprivation decile function are as expected (@test-deprivation.R#107)
     3. Failure: the columns of deprivation decile function are as expected (@test-deprivation.R#111)
     4. Failure: the columns of deprivation decile function are as expected (@test-deprivation.R#113)
     5. Failure: the columns of deprivation decile function are as expected (@test-deprivation.R#115)
     6. Failure: the columns of deprivation decile function are as expected (@test-deprivation.R#117)
     7. Failure: the columns of deprivation decile function are as expected (@test-deprivation.R#119)
     8. Failure: the columns of deprivation decile function are as expected (@test-deprivation.R#121)
    
     Error: testthat unit tests failed
     Execution halted
Flavor: r-devel-linux-x86_64-debian-gcc

Version: 1.0.0
Check: tests
Result: ERROR
     Running ‘a-c.R’ [7s/35s]
     Running ‘d.R’ [14s/100s]
     Running ‘e.R’ [34s/232s]
     Running ‘f-z.R’ [18s/74s]
    Running the tests in ‘tests/d.R’ failed.
    Complete output:
     > library(testthat)
     > library(fingertipsR)
     >
     > test_check("fingertipsR", filter = "^[d]")
    
     |
     | | 0%
     |
     |================== | 25%
     |
     |=================================== | 50%
     |
     |==================================================== | 75%
     |
     |======================================================================| 100%── 1. Failure: the columns of deprivation decile function are as expected (@test
     nrow(dep_102_2015) > 2 isn't true.
    
     ── 2. Failure: the columns of deprivation decile function are as expected (@test
     nrow(dep_101_2015) > 2 isn't true.
    
     ── 3. Failure: the columns of deprivation decile function are as expected (@test
     nrow(dep_7_2015) > 2 isn't true.
    
     ── 4. Failure: the columns of deprivation decile function are as expected (@test
     nrow(dep_201_2015) > 2 isn't true.
    
     ── 5. Failure: the columns of deprivation decile function are as expected (@test
     nrow(dep_202_2015) > 2 isn't true.
    
     ── 6. Failure: the columns of deprivation decile function are as expected (@test
     nrow(dep_154_2015) > 2 isn't true.
    
     ── 7. Failure: the columns of deprivation decile function are as expected (@test
     nrow(dep_165_2015) > 2 isn't true.
    
     ── 8. Failure: the columns of deprivation decile function are as expected (@test
     nrow(dep_8_2015) > 2 isn't true.
    
     ══ testthat results ═══════════════════════════════════════════════════════════
     [ OK: 42 | SKIPPED: 0 | WARNINGS: 0 | FAILED: 8 ]
     1. Failure: the columns of deprivation decile function are as expected (@test-deprivation.R#105)
     2. Failure: the columns of deprivation decile function are as expected (@test-deprivation.R#107)
     3. Failure: the columns of deprivation decile function are as expected (@test-deprivation.R#111)
     4. Failure: the columns of deprivation decile function are as expected (@test-deprivation.R#113)
     5. Failure: the columns of deprivation decile function are as expected (@test-deprivation.R#115)
     6. Failure: the columns of deprivation decile function are as expected (@test-deprivation.R#117)
     7. Failure: the columns of deprivation decile function are as expected (@test-deprivation.R#119)
     8. Failure: the columns of deprivation decile function are as expected (@test-deprivation.R#121)
    
     Error: testthat unit tests failed
     Execution halted
Flavor: r-devel-linux-x86_64-fedora-clang

Version: 1.0.0
Check: re-building of vignette outputs
Result: WARN
    Error(s) in re-building vignettes:
    --- re-building ‘lifeExpectancy.Rmd’ using rmarkdown
    Quitting from lines 140-156 (lifeExpectancy.Rmd)
    Error: processing vignette 'lifeExpectancy.Rmd' failed with diagnostics:
    Faceting variables must have at least one value
    --- failed re-building ‘lifeExpectancy.Rmd’
    
    --- re-building ‘selectIndicatorsRedRed.Rmd’ using rmarkdown
    --- finished re-building ‘selectIndicatorsRedRed.Rmd’
    
    SUMMARY: processing the following file failed:
     ‘lifeExpectancy.Rmd’
    
    Error: Vignette re-building failed.
    Execution halted
Flavors: r-devel-linux-x86_64-fedora-clang, r-devel-linux-x86_64-fedora-gcc, r-devel-windows-ix86+x86_64

Version: 1.0.0
Check: tests
Result: ERROR
     Running ‘a-c.R’ [6s/35s]
     Running ‘d.R’ [13s/79s]
     Running ‘e.R’ [32s/178s]
     Running ‘f-z.R’ [16s/68s]
    Running the tests in ‘tests/d.R’ failed.
    Complete output:
     > library(testthat)
     > library(fingertipsR)
     >
     > test_check("fingertipsR", filter = "^[d]")
    
     |
     | | 0%
     |
     |================== | 25%
     |
     |=================================== | 50%
     |
     |==================================================== | 75%
     |
     |======================================================================| 100%── 1. Failure: the columns of deprivation decile function are as expected (@test
     nrow(dep_102_2015) > 2 isn't true.
    
     ── 2. Failure: the columns of deprivation decile function are as expected (@test
     nrow(dep_101_2015) > 2 isn't true.
    
     ── 3. Failure: the columns of deprivation decile function are as expected (@test
     nrow(dep_7_2015) > 2 isn't true.
    
     ── 4. Failure: the columns of deprivation decile function are as expected (@test
     nrow(dep_201_2015) > 2 isn't true.
    
     ── 5. Failure: the columns of deprivation decile function are as expected (@test
     nrow(dep_202_2015) > 2 isn't true.
    
     ── 6. Failure: the columns of deprivation decile function are as expected (@test
     nrow(dep_154_2015) > 2 isn't true.
    
     ── 7. Failure: the columns of deprivation decile function are as expected (@test
     nrow(dep_165_2015) > 2 isn't true.
    
     ── 8. Failure: the columns of deprivation decile function are as expected (@test
     nrow(dep_8_2015) > 2 isn't true.
    
     ══ testthat results ═══════════════════════════════════════════════════════════
     [ OK: 42 | SKIPPED: 0 | WARNINGS: 0 | FAILED: 8 ]
     1. Failure: the columns of deprivation decile function are as expected (@test-deprivation.R#105)
     2. Failure: the columns of deprivation decile function are as expected (@test-deprivation.R#107)
     3. Failure: the columns of deprivation decile function are as expected (@test-deprivation.R#111)
     4. Failure: the columns of deprivation decile function are as expected (@test-deprivation.R#113)
     5. Failure: the columns of deprivation decile function are as expected (@test-deprivation.R#115)
     6. Failure: the columns of deprivation decile function are as expected (@test-deprivation.R#117)
     7. Failure: the columns of deprivation decile function are as expected (@test-deprivation.R#119)
     8. Failure: the columns of deprivation decile function are as expected (@test-deprivation.R#121)
    
     Error: testthat unit tests failed
     Execution halted
Flavor: r-devel-linux-x86_64-fedora-gcc

Version: 1.0.0
Check: tests
Result: ERROR
     Running 'a-c.R' [40s]
     Running 'd.R' [89s]
     Running 'e.R' [193s]
     Running 'f-z.R' [74s]
    Running the tests in 'tests/d.R' failed.
    Complete output:
     > library(testthat)
     > library(fingertipsR)
     >
     > test_check("fingertipsR", filter = "^[d]")
    
     |
     | | 0%
     |
     |================== | 25%
     |
     |=================================== | 50%
     |
     |==================================================== | 75%
     |
     |======================================================================| 100%-- 1. Failure: the columns of deprivation decile function are as expected (@test
     nrow(dep_102_2015) > 2 isn't true.
    
     -- 2. Failure: the columns of deprivation decile function are as expected (@test
     nrow(dep_101_2015) > 2 isn't true.
    
     -- 3. Failure: the columns of deprivation decile function are as expected (@test
     nrow(dep_7_2015) > 2 isn't true.
    
     -- 4. Failure: the columns of deprivation decile function are as expected (@test
     nrow(dep_201_2015) > 2 isn't true.
    
     -- 5. Failure: the columns of deprivation decile function are as expected (@test
     nrow(dep_202_2015) > 2 isn't true.
    
     -- 6. Failure: the columns of deprivation decile function are as expected (@test
     nrow(dep_154_2015) > 2 isn't true.
    
     -- 7. Failure: the columns of deprivation decile function are as expected (@test
     nrow(dep_165_2015) > 2 isn't true.
    
     -- 8. Failure: the columns of deprivation decile function are as expected (@test
     nrow(dep_8_2015) > 2 isn't true.
    
     == testthat results ===========================================================
     [ OK: 42 | SKIPPED: 0 | WARNINGS: 0 | FAILED: 8 ]
     1. Failure: the columns of deprivation decile function are as expected (@test-deprivation.R#105)
     2. Failure: the columns of deprivation decile function are as expected (@test-deprivation.R#107)
     3. Failure: the columns of deprivation decile function are as expected (@test-deprivation.R#111)
     4. Failure: the columns of deprivation decile function are as expected (@test-deprivation.R#113)
     5. Failure: the columns of deprivation decile function are as expected (@test-deprivation.R#115)
     6. Failure: the columns of deprivation decile function are as expected (@test-deprivation.R#117)
     7. Failure: the columns of deprivation decile function are as expected (@test-deprivation.R#119)
     8. Failure: the columns of deprivation decile function are as expected (@test-deprivation.R#121)
    
     Error: testthat unit tests failed
     Execution halted
Flavor: r-devel-windows-ix86+x86_64

Version: 1.0.0
Check: tests
Result: ERROR
     Running ‘a-c.R’ [5s/32s]
     Running ‘d.R’ [10s/67s]
     Running ‘e.R’ [26s/194s]
     Running ‘f-z.R’ [13s/86s]
    Running the tests in ‘tests/d.R’ failed.
    Complete output:
     > library(testthat)
     > library(fingertipsR)
     >
     > test_check("fingertipsR", filter = "^[d]")
    
     |
     | | 0%
     |
     |================== | 25%
     |
     |=================================== | 50%
     |
     |==================================================== | 75%
     |
     |======================================================================| 100%── 1. Failure: the columns of deprivation decile function are as expected (@test
     nrow(dep_102_2015) > 2 isn't true.
    
     ── 2. Failure: the columns of deprivation decile function are as expected (@test
     nrow(dep_101_2015) > 2 isn't true.
    
     ── 3. Failure: the columns of deprivation decile function are as expected (@test
     nrow(dep_7_2015) > 2 isn't true.
    
     ── 4. Failure: the columns of deprivation decile function are as expected (@test
     nrow(dep_201_2015) > 2 isn't true.
    
     ── 5. Failure: the columns of deprivation decile function are as expected (@test
     nrow(dep_202_2015) > 2 isn't true.
    
     ── 6. Failure: the columns of deprivation decile function are as expected (@test
     nrow(dep_154_2015) > 2 isn't true.
    
     ── 7. Failure: the columns of deprivation decile function are as expected (@test
     nrow(dep_165_2015) > 2 isn't true.
    
     ── 8. Failure: the columns of deprivation decile function are as expected (@test
     nrow(dep_8_2015) > 2 isn't true.
    
     ══ testthat results ═══════════════════════════════════════════════════════════
     [ OK: 42 | SKIPPED: 0 | WARNINGS: 0 | FAILED: 8 ]
     1. Failure: the columns of deprivation decile function are as expected (@test-deprivation.R#105)
     2. Failure: the columns of deprivation decile function are as expected (@test-deprivation.R#107)
     3. Failure: the columns of deprivation decile function are as expected (@test-deprivation.R#111)
     4. Failure: the columns of deprivation decile function are as expected (@test-deprivation.R#113)
     5. Failure: the columns of deprivation decile function are as expected (@test-deprivation.R#115)
     6. Failure: the columns of deprivation decile function are as expected (@test-deprivation.R#117)
     7. Failure: the columns of deprivation decile function are as expected (@test-deprivation.R#119)
     8. Failure: the columns of deprivation decile function are as expected (@test-deprivation.R#121)
    
     Error: testthat unit tests failed
     Execution halted
Flavor: r-patched-linux-x86_64

Version: 1.0.0
Check: tests
Result: ERROR
     Running ‘a-c.R’ [8s/51s]
     Running ‘d.R’ [15s/68s]
     Running ‘e.R’ [43s/181s]
     Running ‘f-z.R’ [16s/72s]
    Running the tests in ‘tests/d.R’ failed.
    Complete output:
     > library(testthat)
     > library(fingertipsR)
     >
     > test_check("fingertipsR", filter = "^[d]")
    
     |
     | | 0%
     |
     |================== | 25%
     |
     |=================================== | 50%
     |
     |==================================================== | 75%
     |
     |======================================================================| 100%── 1. Failure: the columns of deprivation decile function are as expected (@test
     nrow(dep_102_2015) > 2 isn't true.
    
     ── 2. Failure: the columns of deprivation decile function are as expected (@test
     nrow(dep_101_2015) > 2 isn't true.
    
     ── 3. Failure: the columns of deprivation decile function are as expected (@test
     nrow(dep_7_2015) > 2 isn't true.
    
     ── 4. Failure: the columns of deprivation decile function are as expected (@test
     nrow(dep_201_2015) > 2 isn't true.
    
     ── 5. Failure: the columns of deprivation decile function are as expected (@test
     nrow(dep_202_2015) > 2 isn't true.
    
     ── 6. Failure: the columns of deprivation decile function are as expected (@test
     nrow(dep_154_2015) > 2 isn't true.
    
     ── 7. Failure: the columns of deprivation decile function are as expected (@test
     nrow(dep_165_2015) > 2 isn't true.
    
     ── 8. Failure: the columns of deprivation decile function are as expected (@test
     nrow(dep_8_2015) > 2 isn't true.
    
     ══ testthat results ═══════════════════════════════════════════════════════════
     [ OK: 42 | SKIPPED: 0 | WARNINGS: 0 | FAILED: 8 ]
     1. Failure: the columns of deprivation decile function are as expected (@test-deprivation.R#105)
     2. Failure: the columns of deprivation decile function are as expected (@test-deprivation.R#107)
     3. Failure: the columns of deprivation decile function are as expected (@test-deprivation.R#111)
     4. Failure: the columns of deprivation decile function are as expected (@test-deprivation.R#113)
     5. Failure: the columns of deprivation decile function are as expected (@test-deprivation.R#115)
     6. Failure: the columns of deprivation decile function are as expected (@test-deprivation.R#117)
     7. Failure: the columns of deprivation decile function are as expected (@test-deprivation.R#119)
     8. Failure: the columns of deprivation decile function are as expected (@test-deprivation.R#121)
    
     Error: testthat unit tests failed
     Execution halted
Flavor: r-patched-solaris-x86

Version: 1.0.0
Check: re-building of vignette outputs
Result: WARN
    Error(s) in re-building vignettes:
     ...
    --- re-building ‘lifeExpectancy.Rmd’ using rmarkdown
    Warning in engine$weave(file, quiet = quiet, encoding = enc) :
     Pandoc (>= 1.12.3) and/or pandoc-citeproc not available. Falling back to R Markdown v1.
    Quitting from lines 70-72 (lifeExpectancy.Rmd)
    Error: processing vignette 'lifeExpectancy.Rmd' failed with diagnostics:
    there is no package called 'webshot'
    --- failed re-building ‘lifeExpectancy.Rmd’
    
    --- re-building ‘selectIndicatorsRedRed.Rmd’ using rmarkdown
    Warning in engine$weave(file, quiet = quiet, encoding = enc) :
     Pandoc (>= 1.12.3) and/or pandoc-citeproc not available. Falling back to R Markdown v1.
    --- finished re-building ‘selectIndicatorsRedRed.Rmd’
    
    SUMMARY: processing the following file failed:
     ‘lifeExpectancy.Rmd’
    
    Error: Vignette re-building failed.
    Execution halted
Flavor: r-patched-solaris-x86

Version: 1.0.0
Check: tests
Result: ERROR
     Running ‘a-c.R’ [5s/22s]
     Running ‘d.R’ [10s/61s]
     Running ‘e.R’ [25s/156s]
     Running ‘f-z.R’ [13s/59s]
    Running the tests in ‘tests/d.R’ failed.
    Complete output:
     > library(testthat)
     > library(fingertipsR)
     >
     > test_check("fingertipsR", filter = "^[d]")
    
     |
     | | 0%
     |
     |================== | 25%
     |
     |=================================== | 50%
     |
     |==================================================== | 75%
     |
     |======================================================================| 100%── 1. Failure: the columns of deprivation decile function are as expected (@test
     nrow(dep_102_2015) > 2 isn't true.
    
     ── 2. Failure: the columns of deprivation decile function are as expected (@test
     nrow(dep_101_2015) > 2 isn't true.
    
     ── 3. Failure: the columns of deprivation decile function are as expected (@test
     nrow(dep_7_2015) > 2 isn't true.
    
     ── 4. Failure: the columns of deprivation decile function are as expected (@test
     nrow(dep_201_2015) > 2 isn't true.
    
     ── 5. Failure: the columns of deprivation decile function are as expected (@test
     nrow(dep_202_2015) > 2 isn't true.
    
     ── 6. Failure: the columns of deprivation decile function are as expected (@test
     nrow(dep_154_2015) > 2 isn't true.
    
     ── 7. Failure: the columns of deprivation decile function are as expected (@test
     nrow(dep_165_2015) > 2 isn't true.
    
     ── 8. Failure: the columns of deprivation decile function are as expected (@test
     nrow(dep_8_2015) > 2 isn't true.
    
     ══ testthat results ═══════════════════════════════════════════════════════════
     [ OK: 42 | SKIPPED: 0 | WARNINGS: 0 | FAILED: 8 ]
     1. Failure: the columns of deprivation decile function are as expected (@test-deprivation.R#105)
     2. Failure: the columns of deprivation decile function are as expected (@test-deprivation.R#107)
     3. Failure: the columns of deprivation decile function are as expected (@test-deprivation.R#111)
     4. Failure: the columns of deprivation decile function are as expected (@test-deprivation.R#113)
     5. Failure: the columns of deprivation decile function are as expected (@test-deprivation.R#115)
     6. Failure: the columns of deprivation decile function are as expected (@test-deprivation.R#117)
     7. Failure: the columns of deprivation decile function are as expected (@test-deprivation.R#119)
     8. Failure: the columns of deprivation decile function are as expected (@test-deprivation.R#121)
    
     Error: testthat unit tests failed
     Execution halted
Flavor: r-release-linux-x86_64

Version: 1.0.0
Check: re-building of vignette outputs
Result: WARN
    Error(s) in re-building vignettes:
     ...
    --- re-building ‘lifeExpectancy.Rmd’ using rmarkdown
    Warning in engine$weave(file, quiet = quiet, encoding = enc) :
     Pandoc (>= 1.12.3) and/or pandoc-citeproc not available. Falling back to R Markdown v1.
    Quitting from lines 70-72 (lifeExpectancy.Rmd)
    Error: processing vignette 'lifeExpectancy.Rmd' failed with diagnostics:
    cannot open the connection
    --- failed re-building ‘lifeExpectancy.Rmd’
    
    --- re-building ‘selectIndicatorsRedRed.Rmd’ using rmarkdown
    Warning in engine$weave(file, quiet = quiet, encoding = enc) :
     Pandoc (>= 1.12.3) and/or pandoc-citeproc not available. Falling back to R Markdown v1.
    --- finished re-building ‘selectIndicatorsRedRed.Rmd’
    
    SUMMARY: processing the following file failed:
     ‘lifeExpectancy.Rmd’
    
    Error: Vignette re-building failed.
    Execution halted
Flavor: r-release-osx-x86_64

Version: 1.0.0
Check: tests
Result: ERROR
     Running 'a-c.R' [25s]
     Running 'd.R' [62s]
     Running 'e.R' [182s]
     Running 'f-z.R' [55s]
    Running the tests in 'tests/d.R' failed.
    Complete output:
     > library(testthat)
     > library(fingertipsR)
     >
     > test_check("fingertipsR", filter = "^[d]")
    
     |
     | | 0%
     |
     |================== | 25%
     |
     |=================================== | 50%
     |
     |==================================================== | 75%
     |
     |======================================================================| 100%-- 1. Failure: the columns of deprivation decile function are as expected (@test
     nrow(dep_102_2015) > 2 isn't true.
    
     -- 2. Failure: the columns of deprivation decile function are as expected (@test
     nrow(dep_101_2015) > 2 isn't true.
    
     -- 3. Failure: the columns of deprivation decile function are as expected (@test
     nrow(dep_7_2015) > 2 isn't true.
    
     -- 4. Failure: the columns of deprivation decile function are as expected (@test
     nrow(dep_201_2015) > 2 isn't true.
    
     -- 5. Failure: the columns of deprivation decile function are as expected (@test
     nrow(dep_202_2015) > 2 isn't true.
    
     -- 6. Failure: the columns of deprivation decile function are as expected (@test
     nrow(dep_154_2015) > 2 isn't true.
    
     -- 7. Failure: the columns of deprivation decile function are as expected (@test
     nrow(dep_165_2015) > 2 isn't true.
    
     -- 8. Failure: the columns of deprivation decile function are as expected (@test
     nrow(dep_8_2015) > 2 isn't true.
    
     == testthat results ===========================================================
     [ OK: 42 | SKIPPED: 0 | WARNINGS: 0 | FAILED: 8 ]
     1. Failure: the columns of deprivation decile function are as expected (@test-deprivation.R#105)
     2. Failure: the columns of deprivation decile function are as expected (@test-deprivation.R#107)
     3. Failure: the columns of deprivation decile function are as expected (@test-deprivation.R#111)
     4. Failure: the columns of deprivation decile function are as expected (@test-deprivation.R#113)
     5. Failure: the columns of deprivation decile function are as expected (@test-deprivation.R#115)
     6. Failure: the columns of deprivation decile function are as expected (@test-deprivation.R#117)
     7. Failure: the columns of deprivation decile function are as expected (@test-deprivation.R#119)
     8. Failure: the columns of deprivation decile function are as expected (@test-deprivation.R#121)
    
     Error: testthat unit tests failed
     Execution halted
Flavor: r-oldrel-windows-ix86+x86_64

Version: 1.0.0
Check: re-building of vignette outputs
Result: WARN
    Error in re-building vignettes:
     ...
    Quitting from lines 140-156 (lifeExpectancy.Rmd)
    Error: processing vignette 'lifeExpectancy.Rmd' failed with diagnostics:
    Faceting variables must have at least one value
    Execution halted
Flavor: r-oldrel-windows-ix86+x86_64

Version: 1.0.0
Check: re-building of vignette outputs
Result: WARN
    Error in re-building vignettes:
     ...
    Warning in engine$weave(file, quiet = quiet, encoding = enc) :
     Pandoc (>= 1.12.3) and/or pandoc-citeproc not available. Falling back to R Markdown v1.
    Quitting from lines 70-72 (lifeExpectancy.Rmd)
    Error: processing vignette 'lifeExpectancy.Rmd' failed with diagnostics:
    cannot open the connection
    Execution halted
Flavor: r-oldrel-osx-x86_64